BDBM615800 US20230271954, Compound 99::cis-8-4-((cyclobutylmethyl)(p-tolyl)amino) cyclohexyl)(methyl)amino)-5-methyl-6-oxo-5,6- dihydro-1,5-naphthyridine-2,7-dicarbonitrile
SMILES CN([C@H]1CCC(CC1)N(CC1CCC1)c1ccc(C)cc1)c1c(C#N)c(=O)n(C)c2ccc(nc12)C#N
InChI Key InChIKey=QMHHBXISIWOQAF-SBLFQVCHSA-N
Data  2 IC50
  Tab Delimited (TSV)   2D SDfile   Computed 3D by Vconf -m prep SDfile
Find this compound or compounds like it in BindingDB:
Activity Spreadsheet -- Enzyme Inhibition Constant Data from BindingDB
Found 2 hits for monomerid = 615800
TargetDiacylglycerol kinase alpha(Homo sapiens)
Gossamer Bio Services
US Patent
LigandPNGBDBM615800(US20230271954, Compound 99 | cis-8-4-((cyclobutylm...)
Affinity DataIC50:  55nM. Assay description: Compounds of the present invention were prepared into 10 mM DMSO solution and 10 nL of stock was transferred into 384 plates (Optiplate 384 plate) us...
Ligand InfoPC cidPC sid
In DepthDetails US Patent
TargetDiacylglycerol kinase zeta(Homo sapiens)
Gossamer Bio Services
US Patent
LigandPNGBDBM615800(US20230271954, Compound 99 | cis-8-4-((cyclobutylm...)
Affinity DataIC50: <10nM. Assay description: Compounds of the present invention were prepared into 10 mM DMSO solution and 10 nL of stock was transferred into 384 plates (Optiplate 384 plate) us...
Ligand InfoPC cidPC sid
In DepthDetails US Patent