BDBM62097 MLS000584457::N-cyclooctyl-3-keto-2-(2-thenyl)isoindoline-1-carboxamide::N-cyclooctyl-3-oxidanylidene-2-(thiophen-2-ylmethyl)-1H-isoindole-1-carboxamide::N-cyclooctyl-3-oxo-2-(thien-2-ylmethyl)isoindoline-1-carboxamide::N-cyclooctyl-3-oxo-2-(thiophen-2-ylmethyl)-1H-isoindole-1-carboxamide::SMR000207043::cid_4439874
SMILES O=C(NC1CCCCCCC1)C1N(Cc2cccs2)C(=O)c2ccccc12
InChI Key InChIKey=NEPPJVOGOIQHOV-UHFFFAOYSA-N
Data  1 IC50
  Tab Delimited (TSV)   2D SDfile   Computed 3D by Vconf -m prep SDfile
Find this compound or compounds like it in BindingDB:
Activity Spreadsheet -- Enzyme Inhibition Constant Data from BindingDB
Found 1 hit for monomerid = 62097
TargetNeuropeptides B/W receptor type 1(Homo sapiens (Human))
The Scripps Research Institute Molecular Screening Center
Curated by PubChem BioAssay
LigandPNGBDBM62097(MLS000584457 | N-cyclooctyl-3-keto-2-(2-thenyl)iso...)
Affinity DataIC50:  4.38E+4nM. Assay description: Source (MLPCN Center Name): The Scripps Research Institute Molecular Screening Center (SRIMSC) Affiliation: The Scripps Research Institute, TSRI Assa...
In DepthDetails PCBioAssay