BDBM62192 (4Z)-4-[[(5-chloranylquinolin-8-yl)amino]methylidene]-5-methyl-2-(4-methylphenyl)pyrazol-3-one::(4Z)-4-[[(5-chloro-8-quinolinyl)amino]methylidene]-5-methyl-2-(4-methylphenyl)-3-pyrazolone::(4Z)-4-[[(5-chloro-8-quinolyl)amino]methylene]-5-methyl-2-(p-tolyl)-2-pyrazolin-3-one::(4Z)-4-[[(5-chloroquinolin-8-yl)amino]methylidene]-5-methyl-2-(4-methylphenyl)pyrazol-3-one::MLS-0425693.0001::cid_44537710
SMILES Cc1[nH]n(-c2ccc(C)cc2)c(=O)c1C=Nc1ccc(Cl)c2cccnc12
InChI Key InChIKey=UXYFQRIKQIUTEH-WYMPLXKRSA-N
Data  4 IC50  3 EC50
  Tab Delimited (TSV)   2D SDfile   Computed 3D by Vconf -m prep SDfile
Find this compound or compounds like it in BindingDB:
Activity Spreadsheet -- Enzyme Inhibition Constant Data from BindingDB
Found 7 hits for monomerid = 62192
TargetKappa-type opioid receptor(Homo sapiens (Human))
Burnham Center For Chemical Genomics
Curated by PubChem BioAssay
LigandPNGBDBM62192((4Z)-4-[[(5-chloranylquinolin-8-yl)amino]methylide...)
Affinity DataIC50:  1.00E+4nM. Assay description: Data Source: Sanford-Burnham Center for Chemical Genomics (SBCCG) Source Affiliation: Sanford-Burnham Medical Research Institute (SBMRI, San Diego, C...
In DepthDetails PCBioAssay
TargetMu-type opioid receptor(Homo sapiens (Human))
Burnham Center For Chemical Genomics
Curated by PubChem BioAssay
LigandPNGBDBM62192((4Z)-4-[[(5-chloranylquinolin-8-yl)amino]methylide...)
Affinity DataIC50: >3.20E+4nM. Assay description: Data Source: Sanford-Burnham Center for Chemical Genomics (SBCCG) Source Affiliation: Sanford-Burnham Medical Research Institute (SBMRI, San Diego, C...
In DepthDetails PCBioAssay
TargetKappa-type opioid receptor(Homo sapiens (Human))
Burnham Center For Chemical Genomics
Curated by PubChem BioAssay
LigandPNGBDBM62192((4Z)-4-[[(5-chloranylquinolin-8-yl)amino]methylide...)
Affinity DataIC50:  3.20E+4nM. Assay description: Data Source: Sanford-Burnham Center for Chemical Genomics Source Affiliation: Sanford-Burnham Medical Research Institute Network: NIH Molecular Lib...
In DepthDetails PCBioAssay
TargetDelta-type opioid receptor(Homo sapiens (Human))
Burnham Center For Chemical Genomics
Curated by PubChem BioAssay
LigandPNGBDBM62192((4Z)-4-[[(5-chloranylquinolin-8-yl)amino]methylide...)
Affinity DataEC50:  1.48E+4nM. Assay description: Data Source: Sanford-Burnham Center for Chemical Genomics (SBCCG) Source Affiliation: Sanford-Burnham Medical Research Institute (SBMRI, San Diego, C...
In DepthDetails PCBioAssay
TargetDelta-type opioid receptor(Homo sapiens (Human))
Burnham Center For Chemical Genomics
Curated by PubChem BioAssay
LigandPNGBDBM62192((4Z)-4-[[(5-chloranylquinolin-8-yl)amino]methylide...)
Affinity DataIC50:  3.20E+4nM. Assay description: Data Source: Sanford-Burnham Center for Chemical Genomics (SBCCG) Source Affiliation: Sanford-Burnham Medical Research Institute (SBMRI, San Diego, C...
In DepthDetails PCBioAssay
TargetKappa-type opioid receptor(Homo sapiens (Human))
Burnham Center For Chemical Genomics
Curated by PubChem BioAssay
LigandPNGBDBM62192((4Z)-4-[[(5-chloranylquinolin-8-yl)amino]methylide...)
Affinity DataEC50:  3.85E+3nM. Assay description: Data Source: Sanford-Burnham Center for Chemical Genomics Source Affiliation: Sanford-Burnham Medical Research Institute Network: NIH Molecular Lib...
In DepthDetails PCBioAssay
TargetMu-type opioid receptor(Homo sapiens (Human))
Burnham Center For Chemical Genomics
Curated by PubChem BioAssay
LigandPNGBDBM62192((4Z)-4-[[(5-chloranylquinolin-8-yl)amino]methylide...)
Affinity DataEC50:  2.73E+3nM. Assay description: Data Source: Sanford-Burnham Center for Chemical Genomics (SBCCG) Source Affiliation: Sanford-Burnham Medical Research Institute (SBMRI, San Diego, C...
In DepthDetails PCBioAssay