BDBM62481 2-[5-(4-mesylphenyl)tetrazol-2-yl]-N-[2-(methylthio)phenyl]acetamide::2-[5-(4-methylsulfonylphenyl)-2-tetrazolyl]-N-[2-(methylthio)phenyl]acetamide::2-{5-[4-(methylsulfonyl)phenyl]-2H-tetrazol-2-yl}-N-[2-(methylthio)phenyl]acetamide::MLS000682864::N-(2-methylsulfanylphenyl)-2-[5-(4-methylsulfonylphenyl)-1,2,3,4-tetrazol-2-yl]ethanamide::N-(2-methylsulfanylphenyl)-2-[5-(4-methylsulfonylphenyl)tetrazol-2-yl]acetamide::SMR000312221::cid_1503136
SMILES CSc1ccccc1NC(=O)Cn1nnc(n1)-c1ccc(cc1)S(C)(=O)=O
InChI Key InChIKey=VFQLSDWXNPCRML-UHFFFAOYSA-N
Data  2 IC50
  Tab Delimited (TSV)   2D SDfile   Computed 3D by Vconf -m prep SDfile
Find this compound or compounds like it in BindingDB:
Activity Spreadsheet -- Enzyme Inhibition Constant Data from BindingDB
Found 2 hits for monomerid = 62481
TargetEpstein-Barr nuclear antigen 1(Human herpesvirus 4)
The Scripps Research Institute Molecular Screening Center
Curated by PubChem BioAssay
LigandPNGBDBM62481(2-[5-(4-mesylphenyl)tetrazol-2-yl]-N-[2-(methylthi...)
Affinity DataIC50:  6.17E+3nM. Assay description: Source (MLPCN Center Name): The Scripps Research Institute Molecular Screening Center (SRIMSC) Center Affiliation: The Scripps Research Institute (TS...
In DepthDetails PCBioAssay
TargetTrans-activator protein BZLF1(Human herpesvirus 4)
The Scripps Research Institute Molecular Screening Center
Curated by PubChem BioAssay
LigandPNGBDBM62481(2-[5-(4-mesylphenyl)tetrazol-2-yl]-N-[2-(methylthi...)
Affinity DataIC50:  1.11E+5nM. Assay description: Source (MLPCN Center Name): The Scripps Research Institute Molecular Screening Center (SRIMSC) Center Affiliation: The Scripps Research Institute (TS...
In DepthDetails PCBioAssay