BDBM63398 2-methyl-4-[4-(4-morpholinylmethyl)-2-thiophenyl]-5-oxo-N-phenyl-4,6,7,8-tetrahydro-1H-quinoline-3-carboxamide::2-methyl-4-[4-(morpholin-4-ylmethyl)thien-2-yl]-5-oxo-N-phenyl-1,4,5,6,7,8-hexahydroquinoline-3-carboxamide::2-methyl-4-[4-(morpholin-4-ylmethyl)thiophen-2-yl]-5-oxidanylidene-N-phenyl-4,6,7,8-tetrahydro-1H-quinoline-3-carboxamide::2-methyl-4-[4-(morpholin-4-ylmethyl)thiophen-2-yl]-5-oxo-N-phenyl-4,6,7,8-tetrahydro-1H-quinoline-3-carboxamide::5-keto-2-methyl-4-[4-(morpholinomethyl)-2-thienyl]-N-phenyl-4,6,7,8-tetrahydro-1H-quinoline-3-carboxamide::MLS000729321::SMR000307599::cid_5295485
SMILES CC1=C(C(C2C(=O)CCCC2=N1)c1cc(CN2CCOCC2)cs1)C(=O)Nc1ccccc1
InChI Key InChIKey=LNMOEQURKHRSNS-UHFFFAOYSA-N
Data  1 EC50
  Tab Delimited (TSV)   2D SDfile   Computed 3D by Vconf -m prep SDfile
Find this compound or compounds like it in BindingDB:
Activity Spreadsheet -- Enzyme Inhibition Constant Data from BindingDB
Found 1 hit for monomerid = 63398
TargetHeat shock factor protein 1(Mus musculus)
Broad Institute
Curated by PubChem BioAssay
LigandPNGBDBM63398(2-methyl-4-[4-(4-morpholinylmethyl)-2-thiophenyl]-...)
Affinity DataEC50: >1.95E+5nM. Assay description: Keywords: Heat Shock Factor-1 (HSF-1), Stress Response, MG132, NIH3T3, Luminescence Assay Overview: Modified NIH3T3, transformed to express firefly...
In DepthDetails PCBioAssay