BDBM636587 (S)-4,6-dimethyl-2-(pyridin-4- yl)-5,7-dihydro-3-oxa-1-thia-7- azaacenaphthylen-8(4H)-one::US20230365584, Compound 8.
SMILES C[C@H]1Cc2c(C)[nH]c(=O)c3sc(c(O1)c23)-c1ccncc1
InChI Key
Data  1 IC50
  Tab Delimited (TSV)   2D SDfile   Computed 3D by Vconf -m prep SDfile
Find this compound or compounds like it in BindingDB:
Activity Spreadsheet -- Enzyme Inhibition Constant Data from BindingDB
Found 1 hit for monomerid = 636587
TargetCell division cycle 7-related protein kinase(Homo sapiens (Human))
SchrÖDinger
US Patent
LigandPNGBDBM636587((S)-4,6-dimethyl-2-(pyridin-4- yl)-5,7-dihydro-3-o...)
Affinity DataIC50: <1nM. Assay description: Full length human CDC7 protein co-expressed with DBF4 was purchased from SignalChem (China). CDC7 kinase activity was determined with PDKtide (Signal...
Ligand InfoPC cidPC sid
In DepthDetails US Patent