BDBM636590 (S)-5-((3-hydroxypyrrolidin- 1-yl)methyl)-1-(1H-pyrazol-4-yl)- 4,6,7,8-tetrahydro-3H-9-oxa-2-thia-4- azabenzo[cd]azulen-3-one::US20230365584, Compound 11.
SMILES O[C@H]1CCN(Cc2[nH]c(=O)c3sc(-c4cn[nH]c4)c4OCCCc2c34)C1
InChI Key
Data  1 IC50
  Tab Delimited (TSV)   2D SDfile   Computed 3D by Vconf -m prep SDfile
Find this compound or compounds like it in BindingDB:
Activity Spreadsheet -- Enzyme Inhibition Constant Data from BindingDB
Found 1 hit for monomerid = 636590
TargetCell division cycle 7-related protein kinase(Homo sapiens (Human))
SchrÖDinger
US Patent
LigandPNGBDBM636590((S)-5-((3-hydroxypyrrolidin- 1-yl)methyl)-1-(1H-py...)
Affinity DataIC50: <1nM. Assay description: Full length human CDC7 protein co-expressed with DBF4 was purchased from SignalChem (China). CDC7 kinase activity was determined with PDKtide (Signal...
Ligand InfoPC cidPC sid
In DepthDetails US Patent