BDBM636613 5-(1-(cyclobutylamino)ethyl)- 1-(1H-pyrazol-4-yl)-4,6,7,8- tetrahydro-3H-9-oxa-2-thia-4- azabenzo[cd]azulen-3-one::US20230365584, Compound 34.
SMILES CC(NC1CCC1)c1[nH]c(=O)c2sc(-c3cn[nH]c3)c3OCCCc1c23
InChI Key
Data  1 IC50
  Tab Delimited (TSV)   2D SDfile   Computed 3D by Vconf -m prep SDfile
Find this compound or compounds like it in BindingDB:
Activity Spreadsheet -- Enzyme Inhibition Constant Data from BindingDB
Found 1 hit for monomerid = 636613
TargetCell division cycle 7-related protein kinase(Homo sapiens (Human))
SchrÖDinger
US Patent
LigandPNGBDBM636613(5-(1-(cyclobutylamino)ethyl)- 1-(1H-pyrazol-4-yl)-...)
Affinity DataIC50: <1nM. Assay description: Full length human CDC7 protein co-expressed with DBF4 was purchased from SignalChem (China). CDC7 kinase activity was determined with PDKtide (Signal...
Ligand InfoPC cidPC sid
In DepthDetails US Patent