BDBM636626 (S)-2-(1H-pyrazol-4-yl)-7-(1- pyrazol-1-ylethyl)-12-oxa-3-thia-6- azatricyclo[6.4.1.04,13]trideca-1,4(13), 7-trien-5-one::US20230365584, Compound 47.
SMILES C[C@@H](c1[nH]c(=O)c2sc(-c3cn[nH]c3)c3OCCCc1c23)n1cccn1
InChI Key
Data  1 IC50
  Tab Delimited (TSV)   2D SDfile   Computed 3D by Vconf -m prep SDfile
Find this compound or compounds like it in BindingDB:
Activity Spreadsheet -- Enzyme Inhibition Constant Data from BindingDB
Found 1 hit for monomerid = 636626
TargetCell division cycle 7-related protein kinase(Homo sapiens (Human))
SchrÖDinger
US Patent
LigandPNGBDBM636626((S)-2-(1H-pyrazol-4-yl)-7-(1- pyrazol-1-ylethyl)-1...)
Affinity DataIC50: <1nM. Assay description: Full length human CDC7 protein co-expressed with DBF4 was purchased from SignalChem (China). CDC7 kinase activity was determined with PDKtide (Signal...
Ligand InfoPC cidPC sid
In DepthDetails US Patent