BDBM636656 5-(2-hydroxy-2- methylpropyl)-1-(1H-pyrazol-4-yl)- 4,6,7,8-tetrahydro-3H-9-oxa-2-thia-4- azabenzo[cd]azulen-3-one::US20230365584, Compound 77.
SMILES CC(C)(O)Cc1[nH]c(=O)c2sc(-c3cn[nH]c3)c3OCCCc1c23
InChI Key InChIKey=YYAQCJGGKLCODN-UHFFFAOYSA-N
Data  1 IC50
  Tab Delimited (TSV)   2D SDfile   Computed 3D by Vconf -m prep SDfile
Find this compound or compounds like it in BindingDB:
Activity Spreadsheet -- Enzyme Inhibition Constant Data from BindingDB
Found 1 hit for monomerid = 636656
TargetCell division cycle 7-related protein kinase(Homo sapiens (Human))
SchrÖDinger
US Patent
LigandPNGBDBM636656(5-(2-hydroxy-2- methylpropyl)-1-(1H-pyrazol-4-yl)-...)
Affinity DataIC50: <1nM. Assay description: Full length human CDC7 protein co-expressed with DBF4 was purchased from SignalChem (China). CDC7 kinase activity was determined with PDKtide (Signal...
Ligand InfoPC cidPC sid
In DepthDetails US Patent