BDBM646351 US11878973, Example 4
SMILES CCc1c(N2CCN(CC2)C(=O)c2ncccc2O)c(=O)n2nc(nc2n1CC(=O)Nc1cc(Cl)c(cc1C)C(F)(F)F)N1CCOCC1
InChI Key InChIKey=NEXSOUXGQGJMQI-UHFFFAOYSA-N
Data  1 IC50
  Tab Delimited (TSV)   2D SDfile   Computed 3D by Vconf -m prep SDfile
Find this compound or compounds like it in BindingDB:
Activity Spreadsheet -- Enzyme Inhibition Constant Data from BindingDB
Found 1 hit for monomerid = 646351
TargetBifunctional 3'-5' exonuclease/ATP-dependent helicase WRN [517-1238](Homo sapiens (Human))
Novartis
US Patent
LigandPNGBDBM646351(US11878973, Example 4)
Affinity DataIC50:  40nM. Assay description: The core helicase motif of the WRN protein (aa N517-P1238) was produced for this assay (protein production as described above). A 45 oligonucleotide ...
Ligand InfoPC cidPC sid
In DepthDetails US Patent