BDBM646354 US11878973, Example 65
SMILES CCc1c(N2CCN(CC2)C(=O)c2ncc(Cl)cc2O)c(=O)n2nc(nc2n1CC(=O)Nc1ccc(cc1C)C(F)(F)F)C1=CCOCC1
InChI Key InChIKey=GVMNZRLIKIQMED-UHFFFAOYSA-N
Data  1 IC50
  Tab Delimited (TSV)   2D SDfile   Computed 3D by Vconf -m prep SDfile
Find this compound or compounds like it in BindingDB:
Activity Spreadsheet -- Enzyme Inhibition Constant Data from BindingDB
Found 1 hit for monomerid = 646354
TargetBifunctional 3'-5' exonuclease/ATP-dependent helicase WRN [517-1238](Homo sapiens (Human))
Novartis
US Patent
LigandPNGBDBM646354(US11878973, Example 65)
Affinity DataIC50:  50nM. Assay description: The core helicase motif of the WRN protein (aa N517-P1238) was produced for this assay (protein production as described above). A 45 oligonucleotide ...
Ligand InfoPC cidPC sid
In DepthDetails US Patent