BDBM646436 US11878973, Example 39
SMILES CCc1c(N2CCN(CC2)C(=O)c2nccc(Cl)c2O)c(=O)n2nc(nc2n1CC(=O)Nc1ccc(cc1Cl)C(F)(F)F)C1=CCOCC1
InChI Key InChIKey=CFSAWLZFGKGQBB-UHFFFAOYSA-N
Data  1 IC50
  Tab Delimited (TSV)   2D SDfile   Computed 3D by Vconf -m prep SDfile
Find this compound or compounds like it in BindingDB:
Activity Spreadsheet -- Enzyme Inhibition Constant Data from BindingDB
Found 1 hit for monomerid = 646436
TargetBifunctional 3'-5' exonuclease/ATP-dependent helicase WRN [517-1238](Homo sapiens (Human))
Novartis
US Patent
LigandPNGBDBM646436(US11878973, Example 39)
Affinity DataIC50:  40nM. Assay description: The core helicase motif of the WRN protein (aa N517-P1238) was produced for this assay (protein production as described above). A 45 oligonucleotide ...
Ligand InfoPC cidPC sid
In DepthDetails US Patent