BDBM646443 US11878973, Example 106
SMILES CCc1c(N2CCN(CC2)C(=O)c2ncnc(C)c2O)c(=O)n2nc(nc2n1CC(=O)Nc1ccc(Br)cc1Cl)C1=CCOCC1
InChI Key InChIKey=OICAMRBULRJOOS-UHFFFAOYSA-N
Data  1 IC50
  Tab Delimited (TSV)   2D SDfile   Computed 3D by Vconf -m prep SDfile
Find this compound or compounds like it in BindingDB:
Activity Spreadsheet -- Enzyme Inhibition Constant Data from BindingDB
Found 1 hit for monomerid = 646443
TargetBifunctional 3'-5' exonuclease/ATP-dependent helicase WRN [517-1238](Homo sapiens (Human))
Novartis
US Patent
LigandPNGBDBM646443(US11878973, Example 106)
Affinity DataIC50:  60nM. Assay description: The core helicase motif of the WRN protein (aa N517-P1238) was produced for this assay (protein production as described above). A 45 oligonucleotide ...
Ligand InfoPC cidPC sid
In DepthDetails US Patent