BDBM646489 N-(2-chloro-4-(trifluoromethyl)phenyl)-2-(2-(3,6-dihydro-2H-pyran-4-yl)-5-ethyl-6-(4-((3-hydroxypyridin-2-yl)sulfonyl)piperazin-1-yl)-7-oxo-[1,2,4]triazolo[1,5-a]pyrimidin-4(7H)-yl)acetamide::US11878973, Example 137
SMILES CCc1c(N2CCN(CC2)S(=O)(=O)c2ncccc2O)c(=O)n2nc(nc2n1CC(=O)Nc1ccc(cc1Cl)C(F)(F)F)C1=CCOCC1
InChI Key InChIKey=MFBSIRBPKDEVPB-UHFFFAOYSA-N
Data  1 IC50
  Tab Delimited (TSV)   2D SDfile   Computed 3D by Vconf -m prep SDfile
Find this compound or compounds like it in BindingDB:
Activity Spreadsheet -- Enzyme Inhibition Constant Data from BindingDB
Found 1 hit for monomerid = 646489
TargetBifunctional 3'-5' exonuclease/ATP-dependent helicase WRN [517-1238](Homo sapiens (Human))
Novartis
US Patent
LigandPNGBDBM646489(N-(2-chloro-4-(trifluoromethyl)phenyl)-2-(2-(3,6-d...)
Affinity DataIC50:  50nM. Assay description: The core helicase motif of the WRN protein (aa N517-P1238) was produced for this assay (protein production as described above). A 45 oligonucleotide ...
Ligand InfoPC cidPC sid
In DepthDetails US Patent