BDBM64792 4-O-[3-cyclopropyl-2-(4-hydroxybutyl)-7-methyl-6,8-dioxoisoquinolin-7-yl] 1-O-methyl butanedioate::CMLD003552::MLS000438594::O4-[3-cyclopropyl-7-methyl-2-(4-oxidanylbutyl)-6,8-bis(oxidanylidene)isoquinolin-7-yl] O1-methyl butanedioate::SMR000452646::butanedioic acid O4-[3-cyclopropyl-2-(4-hydroxybutyl)-7-methyl-6,8-dioxo-7-isoquinolinyl] ester O1-methyl ester::cid_16745608::succinic acid O4-[3-cyclopropyl-2-(4-hydroxybutyl)-6,8-diketo-7-methyl-7-isoquinolyl] ester O1-methyl ester
SMILES COC(=O)CCC(=O)OC1(C)C(=O)C=C2C=C(C3CC3)N(CCCCO)C=C2C1=O
InChI Key InChIKey=XXIWCJHYACCRFZ-UHFFFAOYSA-N
Data  5 IC50
  Tab Delimited (TSV)   2D SDfile   Computed 3D by Vconf -m prep SDfile
Find this compound or compounds like it in BindingDB:
Activity Spreadsheet -- Enzyme Inhibition Constant Data from BindingDB
Found 3 hits for monomerid = 64792
TargetApoptotic protease-activating factor 1(Homo sapiens (Human))
Burnham Center For Chemical Genomics
Curated by PubChem BioAssay
LigandPNGBDBM64792(4-O-[3-cyclopropyl-2-(4-hydroxybutyl)-7-methyl-6,8...)
Affinity DataIC50: >1.00E+5nM. Assay description: Data Source: Sanford-Burnham Center for Chemical Genomics (SBCCG) Source Affiliation: Sanford-Burnham Medical Research Institute (SBIMR, San Diego, C...
In DepthDetails PCBioAssay
TargetApoptotic protease-activating factor 1(Homo sapiens (Human))
Burnham Center For Chemical Genomics
Curated by PubChem BioAssay
LigandPNGBDBM64792(4-O-[3-cyclopropyl-2-(4-hydroxybutyl)-7-methyl-6,8...)
Affinity DataIC50:  1.94E+4nM. Assay description: Data Source: Sanford-Burnham Center for Chemical Genomics (SBCCG) Source Affiliation: Sanford-Burnham Medical Research Institute (SBIMR, San Diego, C...
In DepthDetails PCBioAssay
TargetCaspase-9(Homo sapiens (Human))
Burnham Center For Chemical Genomics
Curated by PubChem BioAssay
LigandPNGBDBM64792(4-O-[3-cyclopropyl-2-(4-hydroxybutyl)-7-methyl-6,8...)
Affinity DataIC50:  2.43E+4nM. Assay description: Data Source: Sanford-Burnham Center for Chemical Genomics (SBCCG) Source Affiliation: Sanford-Burnham Medical Research Institute (SBIMR, San Diego, C...
In DepthDetails PCBioAssay