BDBM67327 1-(4-Chloro-phenyl)-2-(2,5-dimethyl-phenylamino)-ethanone::1-(4-chlorophenyl)-2-(2,5-dimethylanilino)ethanone::1-(4-chlorophenyl)-2-[(2,5-dimethylphenyl)amino]ethanone::MLS001212840::SMR000517340::cid_788619
SMILES Cc1ccc(C)c(NCC(=O)c2ccc(Cl)cc2)c1
InChI Key InChIKey=ILJCNGSHKONNGT-UHFFFAOYSA-N
Data  2 IC50
  Tab Delimited (TSV)   2D SDfile   Computed 3D by Vconf -m prep SDfile
Find this compound or compounds like it in BindingDB:
Activity Spreadsheet -- Enzyme Inhibition Constant Data from BindingDB
Found 2 hits for monomerid = 67327
TargetType-1 angiotensin II receptor(Homo sapiens (Human))
Burnham Center For Chemical Genomics
Curated by PubChem BioAssay
LigandPNGBDBM67327(1-(4-Chloro-phenyl)-2-(2,5-dimethyl-phenylamino)-e...)
Affinity DataIC50:  1.44E+4nM. Assay description: Data Source: Sanford-Burnham Center for Chemical Genomics (SBCCG) Source Affiliation: Sanford-Burnham Medical Research Institute(SBMRI, San Diego, C...
In DepthDetails PCBioAssay
TargetApelin receptor(Homo sapiens (Human))
Sanford-Burnham Center For Chemical Genomics
Curated by PubChem BioAssay
LigandPNGBDBM67327(1-(4-Chloro-phenyl)-2-(2,5-dimethyl-phenylamino)-e...)
Affinity DataIC50:  1.59E+3nM. Assay description: Data Source: Sanford-Burnham Center for Chemical Genomics (SBCCG) Source Affiliation: Sanford- Sanford-Burnham Medical Research Institute(SBMRI, San...
In DepthDetails PCBioAssay