BDBM7019 (4R,5S,6S,7R)-4,7-bis(2,3-dihydro-1,4-benzodioxin-6-ylmethyl)-1,3-bis[(3-acetylphenyl)methyl]-5,6-dihydroxy-1,3-diazepan-2-one::(4R,5S,6S,7R)-Hexahydro-5,6-dihydroxy-1,3-bis(3-acetylbenzyl)-4,7-bis((3,4-(ethylenedioxy)phenyl)methyl)-2H-1,3-diazapin-2-one::Cyclic Urea Based HIV-1 Protease Inhibitor 13
SMILES CC(=O)c1cccc(CN2[C@H](Cc3ccc4OCCOc4c3)[C@H](O)[C@@H](O)[C@@H](Cc3ccc4OCCOc4c3)N(Cc3cccc(c3)C(C)=O)C2=O)c1
InChI Key InChIKey=LFTMEZYTSNGORM-HVPIWBAOSA-N
Data  1 KI
  Tab Delimited (TSV)   2D SDfile   Computed 3D by Vconf -m prep SDfile
Find this compound or compounds like it in BindingDB:
Activity Spreadsheet -- Enzyme Inhibition Constant Data from BindingDB
Found 1 hit for monomerid = 7019
TargetDimer of Gag-Pol polyprotein [489-587](Human immunodeficiency virus type 1)
Dupont Pharmaceuticals
LigandPNGBDBM7019((4R,5S,6S,7R)-4,7-bis(2,3-dihydro-1,4-benzodioxin-...)
Affinity DataKi:  0.0400nM ΔG°:  -14.7kcal/molepH: 5.5 T: 2°C. Assay description: Inhibition of HIV protease was measured by assay of the cleavage of a fluorescent peptide substrate. The fluorescent product (2-aminobenzoyl-Ala-Thr-...
In DepthDetails ArticlePubMed