BDBM7182 3-(4-methylphenyl)-3,4,10,11-tetraazatricyclo[7.3.0.0^{2,6}]dodeca-1(9),2(6),4,11-tetraene-5-carboxamide::tetrahydro-benzodipyrazole deriv. 7i
SMILES Cc1ccc(cc1)-n1nc(C(N)=O)c2CCc3[nH]ncc3-c12
InChI Key InChIKey=XOIQTGKKNJREKY-UHFFFAOYSA-N
Data  1 IC50
  Tab Delimited (TSV)   2D SDfile   Computed 3D by Vconf -m prep SDfile
Find this compound or compounds like it in BindingDB:
Activity Spreadsheet -- Enzyme Inhibition Constant Data from BindingDB
Found 1 hit for monomerid = 7182
TargetCyclin-A2/Cyclin-dependent kinase 2(Homo sapiens (Human))
Nerviano Medical Sciences
LigandPNGBDBM7182(3-(4-methylphenyl)-3,4,10,11-tetraazatricyclo[7.3....)
Affinity DataIC50:  140nM. Assay description: The biochemical activity of compounds was determined by incubation with specific enzymes and substrates in the presence ATP/[gamma-33P] ATP. After in...
In DepthDetails ArticlePubMed