BDBM7212 3-methyl-3,4,10,11-tetraazatricyclo[7.3.0.0^{2,6}]dodeca-1(9),2(6),4,7,11-pentaene-5-carboxamide::dihydro-benzodipyrazole deriv. 7x
SMILES Cn1nc(C(N)=O)c2ccc3[nH]ncc3c12
InChI Key InChIKey=BSVWYBFSOQGZFD-UHFFFAOYSA-N
Data  1 IC50
  Tab Delimited (TSV)   2D SDfile   Computed 3D by Vconf -m prep SDfile
Find this compound or compounds like it in BindingDB:
Activity Spreadsheet -- Enzyme Inhibition Constant Data from BindingDB
Found 1 hit for monomerid = 7212
TargetCyclin-A2/Cyclin-dependent kinase 2(Homo sapiens (Human))
Nerviano Medical Sciences
LigandPNGBDBM7212(3-methyl-3,4,10,11-tetraazatricyclo[7.3.0.0^{2,6}]...)
Affinity DataIC50:  18nM. Assay description: The biochemical activity of compounds was determined by incubation with specific enzymes and substrates in the presence ATP/[gamma-33P] ATP. After in...
In DepthDetails ArticlePubMed