BDBM74809 6-methyl-2-[[1-oxo-2-(5H-[1,2,4]triazino[5,6-b]indol-3-ylthio)ethyl]amino]-5,7-dihydro-4H-thieno[2,3-c]pyridine-3-carboxylic acid ethyl ester::6-methyl-2-[[2-(5H-[1,2,4]triazin[5,6-b]indol-3-ylthio)acetyl]amino]-5,7-dihydro-4H-thieno[2,3-c]pyridine-3-carboxylic acid ethyl ester::MLS000575379::SMR000196613::cid_5734646::ethyl 6-methyl-2-[2-(5H-[1,2,4]triazino[5,6-b]indol-3-ylsulfanyl)ethanoylamino]-5,7-dihydro-4H-thieno[2,3-c]pyridine-3-carboxylate::ethyl 6-methyl-2-[[2-(5H-[1,2,4]triazino[5,6-b]indol-3-ylsulfanyl)acetyl]amino]-5,7-dihydro-4H-thieno[2,3-c]pyridine-3-carboxylate::ethyl 6-methyl-2-{[(5H-[1,2,4]triazino[5,6-b]indol-3-ylthio)acetyl]amino}-4,5,6,7-tetrahydrothieno[2,3-c]pyridine-3-carboxylate
SMILES CCOC(=O)c1c(NC(=O)CSc2nnc3c(n2)[nH]c2ccccc32)sc2CN(C)CCc12
InChI Key InChIKey=QGVYUVDDXQYTSO-UHFFFAOYSA-N
Data  1 IC50  1 EC50
  Tab Delimited (TSV)   2D SDfile   Computed 3D by Vconf -m prep SDfile
Find this compound or compounds like it in BindingDB:
Activity Spreadsheet -- Enzyme Inhibition Constant Data from BindingDB
Found 2 hits for monomerid = 74809
TargetProtein artemis(Homo sapiens (Human))
Burnham Center For Chemical Genomics
Curated by PubChem BioAssay
LigandPNGBDBM74809(6-methyl-2-[[1-oxo-2-(5H-[1,2,4]triazino[5,6-b]ind...)
Affinity DataIC50:  1.00E+4nM. Assay description: Data Source: Sanford-Burnham Center for Chemical Genomics (SBCCG) Source Affiliation: Sanford-Burnham Medical Research Institute (SBMRI, San Diego CA...
In DepthDetails PCBioAssay
TargetImportin subunit alpha-1(Homo sapiens (Human))
Broad Institute
Curated by PubChem BioAssay
LigandPNGBDBM74809(6-methyl-2-[[1-oxo-2-(5H-[1,2,4]triazino[5,6-b]ind...)
Affinity DataEC50: >5.00E+5nM. Assay description: Keywords: Counterscreen, FRET assay, HTS, YIC probe, Dose response, Assay Overview: This is a fluorescence resonance energy transfer (FRET)-based b...
In DepthDetails PCBioAssay