BDBM75579 KSC-11-155-1::KUC105600N::N-[2-[(phenylmethyl)-propan-2-yl-amino]ethyl]-4-[[(4-propan-2-ylphenyl)sulfonylamino]methyl]benzamide::N-[2-[(phenylmethyl)-propan-2-ylamino]ethyl]-4-[[(4-propan-2-ylphenyl)sulfonylamino]methyl]benzamide::N-[2-[benzyl(isopropyl)amino]ethyl]-4-[(p-cumenylsulfonylamino)methyl]benzamide::N-[2-[benzyl(propan-2-yl)amino]ethyl]-4-[[(4-propan-2-ylphenyl)sulfonylamino]methyl]benzamide::cid_45479162
SMILES CC(C)N(CCNC(=O)c1ccc(CNS(=O)(=O)c2ccc(cc2)C(C)C)cc1)Cc1ccccc1
InChI Key InChIKey=JXSIHKBQOQHZGF-UHFFFAOYSA-N
Data  4 IC50
  Tab Delimited (TSV)   2D SDfile   Computed 3D by Vconf -m prep SDfile
Find this compound or compounds like it in BindingDB:
Activity Spreadsheet -- Enzyme Inhibition Constant Data from BindingDB
Found 1 hit for monomerid = 75579
TargetDelta-type opioid receptor(Homo sapiens (Human))
Burnham Center For Chemical Genomics
Curated by PubChem BioAssay
LigandPNGBDBM75579(KSC-11-155-1 | KUC105600N | N-[2-[(phenylmethyl)-p...)
Affinity DataIC50: >3.20E+4nM. Assay description: Data Source: Sanford-Burnham Center for Chemical Genomics (SBCCG) Source Affiliation: Sanford-Burnham Medical Research Institute (SBMRI, San Diego, C...
In DepthDetails PCBioAssay