BDBM75869 1-(4-chlorophenyl)-5-[(E)-(phenylthiocarbamoylhydrazono)methyl]pyrazole-4-carboxylic acid methyl ester::5-[(E)-[[anilino(sulfanylidene)methyl]hydrazinylidene]methyl]-1-(4-chlorophenyl)-4-pyrazolecarboxylic acid methyl ester::MLS-0437446.0001::cid_9581015::methyl 1-(4-chlorophenyl)-5-[(E)-(phenylcarbamothioylhydrazinylidene)methyl]pyrazole-4-carboxylate
SMILES COC(=O)c1cnn(c1C=NNC(=S)Nc1ccccc1)-c1ccc(Cl)cc1
InChI Key InChIKey=IOTJXEMRQZVVKK-UHFFFAOYSA-N
Data  3 IC50
  Tab Delimited (TSV)   2D SDfile   Computed 3D by Vconf -m prep SDfile
Find this compound or compounds like it in BindingDB:
Activity Spreadsheet -- Enzyme Inhibition Constant Data from BindingDB
Found 1 hit for monomerid = 75869
TargetG-protein coupled receptor 35(Homo sapiens (Human))
Burnham Center For Chemical Genomics
Curated by PubChem BioAssay
LigandPNGBDBM75869(1-(4-chlorophenyl)-5-[(E)-(phenylthiocarbamoylhydr...)
Affinity DataIC50:  2.18E+4nM. Assay description: Data Source: Dr. Mary Abood Source Affiliation: Temple University Network: NIH Molecular Libraries Probe Production Centers Network (MLPCN) Grant Pro...
In DepthDetails PCBioAssay