BDBM76818 (4-Methyl-piperidin-1-yl)-[1-(3-phenyl-propyl)-piperidin-4-yl]-methanone::(4-methyl-1-piperidinyl)-[1-(3-phenylpropyl)-4-piperidinyl]methanone;oxalic acid::(4-methylpiperidin-1-yl)-[1-(3-phenylpropyl)piperidin-4-yl]methanone;oxalic acid::(4-methylpiperidino)-[1-(3-phenylpropyl)-4-piperidyl]methanone;oxalic acid::MLS000031302::SMR000012611::cid_647773::ethanedioic acid;(4-methylpiperidin-1-yl)-[1-(3-phenylpropyl)piperidin-4-yl]methanone
SMILES CC1CCN(CC1)C(=O)C1CCN(CCCc2ccccc2)CC1
InChI Key InChIKey=QNRHKSZNPGFUGL-UHFFFAOYSA-N
Data  1 EC50
  Tab Delimited (TSV)   2D SDfile   Computed 3D by Vconf -m prep SDfile
Find this compound or compounds like it in BindingDB:
Activity Spreadsheet -- Enzyme Inhibition Constant Data from BindingDB
Found 1 hit for monomerid = 76818
TargetVoltage-dependent T-type calcium channel subunit alpha-1H(Homo sapiens (Human))
Vanderbilt Screening Center For Gpcrs, Ion Channels and Transporters
Curated by PubChem BioAssay
LigandPNGBDBM76818((4-Methyl-piperidin-1-yl)-[1-(3-phenyl-propyl)-pip...)
Affinity DataEC50:  7.69E+3nM. Assay description: Assay Provider: Xinmin Xie Assay Provider Affiliation: Bioscience Division, SRI International, Menlo Park, CA Grant Title: HTS Assay for Cav3 T-Type ...
In DepthDetails PCBioAssay