BDBM77084 MLS000109187::N-(5-chloranylpyridin-2-yl)-3-(diethylsulfamoyl)-4-methyl-benzamide::N-(5-chloro-2-pyridinyl)-3-(diethylsulfamoyl)-4-methylbenzamide::N-(5-chloro-2-pyridyl)-3-(diethylsulfamoyl)-4-methyl-benzamide::N-(5-chloropyridin-2-yl)-3-(diethylsulfamoyl)-4-methylbenzamide::SMR000105133::cid_1039727
SMILES CCN(CC)S(=O)(=O)c1cc(ccc1C)C(=O)Nc1ccc(Cl)cn1
InChI Key InChIKey=FQKMWQCFJUGANE-UHFFFAOYSA-N
Data  1 EC50
  Tab Delimited (TSV)   2D SDfile   Computed 3D by Vconf -m prep SDfile
Find this compound or compounds like it in BindingDB:
Activity Spreadsheet -- Enzyme Inhibition Constant Data from BindingDB
Found 1 hit for monomerid = 77084
TargetVoltage-dependent T-type calcium channel subunit alpha-1H(Homo sapiens (Human))
Vanderbilt Screening Center For Gpcrs, Ion Channels and Transporters
Curated by PubChem BioAssay
LigandPNGBDBM77084(MLS000109187 | N-(5-chloranylpyridin-2-yl)-3-(diet...)
Affinity DataEC50:  2.30E+3nM. Assay description: Assay Provider: Xinmin Xie Assay Provider Affiliation: Bioscience Division, SRI International, Menlo Park, CA Grant Title: HTS Assay for Cav3 T-Type ...
In DepthDetails PCBioAssay