BDBM78000 MLS000091924::N-[2-(3,4-dihydro-1H-isoquinolin-2-yl)ethyl]-7-methoxy-2-furo[2,3-b]quinolinecarboxamide::N-[2-(3,4-dihydro-1H-isoquinolin-2-yl)ethyl]-7-methoxy-furo[2,3-b]quinoline-2-carboxamide::N-[2-(3,4-dihydro-1H-isoquinolin-2-yl)ethyl]-7-methoxyfuro[2,3-b]quinoline-2-carboxamide::N-[2-(3,4-dihydroisoquinolin-2(1H)-yl)ethyl]-7-methoxyfuro[2,3-b]quinoline-2-carboxamide::SMR000026448::cid_3238061
SMILES COc1ccc2cc3cc(oc3nc2c1)C(=O)NCCN1CCc2ccccc2C1
InChI Key InChIKey=NKKZGLXAOYDZQW-UHFFFAOYSA-N
Data  2 IC50
  Tab Delimited (TSV)   2D SDfile   Computed 3D by Vconf -m prep SDfile
Find this compound or compounds like it in BindingDB:
Activity Spreadsheet -- Enzyme Inhibition Constant Data from BindingDB
Found 2 hits for monomerid = 78000
TargetMitochondrial import inner membrane translocase subunit TIM23(Saccharomyces cerevisiae S288c)
Burnham Center For Chemical Genomics
Curated by PubChem BioAssay
LigandPNGBDBM78000(MLS000091924 | N-[2-(3,4-dihydro-1H-isoquinolin-2-...)
Affinity DataIC50:  3.34E+3nM. Assay description: Data Source: Sanford-Burnham Center for Chemical Genomics (SBCCG) Source Affiliation: Sanford-Burnham Medical Research Institute(SBMRI, San Diego, CA...
In DepthDetails PCBioAssay
TargetMitochondrial import inner membrane translocase subunit TIM10(Saccharomyces cerevisiae S288c)
Burnham Center For Chemical Genomics
Curated by PubChem BioAssay
LigandPNGBDBM78000(MLS000091924 | N-[2-(3,4-dihydro-1H-isoquinolin-2-...)
Affinity DataIC50:  690nM. Assay description: Data Source: Sanford-Burnham Center for Chemical Genomics (SBCCG) Source Affiliation: Sanford-Burnham Medical Research Institute(SBMRI, San Diego, CA...
In DepthDetails PCBioAssay