BDBM78323 1-butyl-3-[(2-ketoindol-3-yl)amino]thiourea::1-butyl-3-[(2-oxidanylideneindol-3-yl)amino]thiourea::1-butyl-3-[(2-oxo-3-indolyl)amino]thiourea::1-butyl-3-[(2-oxoindol-3-yl)amino]thiourea::MLS000760043::SMR000370148::cid_6106331
SMILES CCCCNC(=S)NNC1=c2ccccc2=NC1=O
InChI Key InChIKey=FSTPQTUPBDIXJL-UHFFFAOYSA-N
Data  5 IC50
  Tab Delimited (TSV)   2D SDfile   Computed 3D by Vconf -m prep SDfile
Find this compound or compounds like it in BindingDB:
Activity Spreadsheet -- Enzyme Inhibition Constant Data from BindingDB
Found 5 hits for monomerid = 78323
TargetMitochondrial import inner membrane translocase subunit TIM10(Saccharomyces cerevisiae S288c)
Burnham Center For Chemical Genomics
Curated by PubChem BioAssay
LigandPNGBDBM78323(1-butyl-3-[(2-ketoindol-3-yl)amino]thiourea | 1-bu...)
Affinity DataIC50:  9.90E+3nM. Assay description: Data Source: Sanford-Burnham Center for Chemical Genomics (SBCCG) Source Affiliation: Sanford-Burnham Medical Research Institute(SBMRI, San Diego, CA...
In DepthDetails PCBioAssay
TargetUbiquitin-conjugating enzyme E2 N(Homo sapiens (Human))
Burnham Center For Chemical Genomics
Curated by PubChem BioAssay
LigandPNGBDBM78323(1-butyl-3-[(2-ketoindol-3-yl)amino]thiourea | 1-bu...)
Affinity DataIC50:  8.60E+3nM. Assay description: Data Source: Sanford-Burnham Center for Chemical Genomics (SBCCG) Source Affiliation: Sanford-Burnham Medical Research Institute (SBMRI, San Diego CA...
In DepthDetails PCBioAssay
TargetUbiquitin-conjugating enzyme E2 N(Homo sapiens (Human))
Burnham Center For Chemical Genomics
Curated by PubChem BioAssay
LigandPNGBDBM78323(1-butyl-3-[(2-ketoindol-3-yl)amino]thiourea | 1-bu...)
Affinity DataIC50:  5.96E+3nM. Assay description: Data Source: Sanford-Burnham Center for Chemical Genomics (SBCCG) Source Affiliation: Sanford-Burnham Medical Research Institute (SBMRI, San Diego CA...
In DepthDetails PCBioAssay
TargetBcl-2-related protein A1(Mus musculus (Mouse))
Burnham Center For Chemical Genomics
Curated by PubChem BioAssay
LigandPNGBDBM78323(1-butyl-3-[(2-ketoindol-3-yl)amino]thiourea | 1-bu...)
Affinity DataIC50: >2.00E+4nM. Assay description: Data Source: Sanford-Burnham Center for Chemical Genomics (SBCCG) Source Affiliation: Sanford-Burnham Medical Research Institute (SBMRI, San Diego CA...
In DepthDetails PCBioAssay
TargetMitochondrial import inner membrane translocase subunit TIM23(Saccharomyces cerevisiae S288c)
Burnham Center For Chemical Genomics
Curated by PubChem BioAssay
LigandPNGBDBM78323(1-butyl-3-[(2-ketoindol-3-yl)amino]thiourea | 1-bu...)
Affinity DataIC50:  4.92E+3nM. Assay description: Data Source: Sanford-Burnham Center for Chemical Genomics (SBCCG) Source Affiliation: Sanford-Burnham Medical Research Institute(SBMRI, San Diego, CA...
In DepthDetails PCBioAssay