BDBM79435 (E)-2-Cyano-3-(2,5-dimethoxy-phenylamino)-acrylic acid ethyl ester::(E)-2-cyano-3-(2,5-dimethoxyanilino)-2-propenoic acid ethyl ester::(E)-2-cyano-3-(2,5-dimethoxyanilino)acrylic acid ethyl ester::MLS000590927::SMR000217816::cid_1957350::ethyl (E)-2-cyano-3-(2,5-dimethoxyanilino)prop-2-enoate::ethyl (E)-2-cyano-3-[(2,5-dimethoxyphenyl)amino]prop-2-enoate
SMILES CCOC(=O)C(C=Nc1cc(OC)ccc1OC)C#N
InChI Key InChIKey=JRSXAHFDBYQTSY-UHFFFAOYSA-N
Data  2 EC50
  Tab Delimited (TSV)   2D SDfile   Computed 3D by Vconf -m prep SDfile
Find this compound or compounds like it in BindingDB:
Activity Spreadsheet -- Enzyme Inhibition Constant Data from BindingDB
Found 2 hits for monomerid = 79435
TargetCaspase-7(Homo sapiens (Human))
The Scripps Research Institute Molecular Screening Center
Curated by PubChem BioAssay
LigandPNGBDBM79435((E)-2-Cyano-3-(2,5-dimethoxy-phenylamino)-acrylic ...)
Affinity DataEC50: >8.53E+4nM. Assay description: Source (MLPCN Center Name): The Scripps Research Institute Molecular Screening Center (SRIMSC) Affiliation: The Scripps Research Institute, TSRI Assa...
In DepthDetails PCBioAssay
TargetCaspase-3(Homo sapiens (Human))
The Scripps Research Institute Molecular Screening Center
Curated by PubChem BioAssay
LigandPNGBDBM79435((E)-2-Cyano-3-(2,5-dimethoxy-phenylamino)-acrylic ...)
Affinity DataEC50: >8.53E+4nM. Assay description: Source (MLPCN Center Name): The Scripps Research Institute Molecular Screening Center (SRIMSC) Affiliation: The Scripps Research Institute, TSRI Assa...
In DepthDetails PCBioAssay