BDBM80059 (6E)-6-[[(5-nitro-2-pyridinyl)hydrazo]methylidene]-1-cyclohexa-2,4-dienone::(6E)-6-[[2-(5-nitropyridin-2-yl)hydrazinyl]methylidene]cyclohexa-2,4-dien-1-one::(6E)-6-[[N'-(5-nitro-2-pyridyl)hydrazino]methylene]cyclohexa-2,4-dien-1-one::MLS002608402::SMR001527151::cid_5355653
SMILES [O-][N+](=O)c1ccc(N=[NH+]C[c-]2ccccc2=O)nc1
InChI Key InChIKey=ONPDHCWUKSUICZ-UHFFFAOYSA-O
Data  2 IC50
  Tab Delimited (TSV)   2D SDfile   Computed 3D by Vconf -m prep SDfile
Find this compound or compounds like it in BindingDB:
Activity Spreadsheet -- Enzyme Inhibition Constant Data from BindingDB
Found 1 hit for monomerid = 80059
TargetBeta-galactosidase(Escherichia coli)
Burnham Center For Chemical Genomics
Curated by PubChem BioAssay
LigandPNGBDBM80059((6E)-6-[[(5-nitro-2-pyridinyl)hydrazo]methylidene]...)
Affinity DataIC50:  4.60E+4nM. Assay description: Data Source: Sanford-Burnham Center for Chemical Genomics (SBCCG) Source Affiliation: Sanford-Burnham Medical Research Institute(SBMRI, San Diego, C...
In DepthDetails PCBioAssay