BDBM80387 (3-methyl-1,3-thiazinan-2-ylidene)-p-phenetyl-amine;hydroiodide::(4-Ethoxy-phenyl)-(3-methyl-[1,3]thiazinan-2-ylidene)-amine::MLS000122383::N-(4-ethoxyphenyl)-3-methyl-1,3-thiazinan-2-imine;hydroiodide::SMR000119742::cid_9549417
SMILES CCOc1ccc(cc1)\N=C1\SCCCN1C
InChI Key InChIKey=DUBOCRZVGGGQSK-BUHFOSPRSA-N
Data  3 IC50
  Tab Delimited (TSV)   2D SDfile   Computed 3D by Vconf -m prep SDfile
Find this compound or compounds like it in BindingDB:
Activity Spreadsheet -- Enzyme Inhibition Constant Data from BindingDB
Found 3 hits for monomerid = 80387
TargetDNA dC->dU-editing enzyme APOBEC-3A(Homo sapiens (Human))
Burnham Center For Chemical Genomics
Curated by PubChem BioAssay
LigandPNGBDBM80387((3-methyl-1,3-thiazinan-2-ylidene)-p-phenetyl-amin...)
Affinity DataIC50:  2.19E+3nMT: 2°C. Assay description: Data Source: Sanford-Burnham Center for Chemical Genomics (SBCCG) Source Affiliation: Sanford-Burnham Medical Research Institute (SBMRI, San Diego, C...
In DepthDetails PCBioAssay
TargetCarboxy-terminal domain RNA polymerase II polypeptide A small phosphatase 1(Homo sapiens (Human))
Burnham Center For Chemical Genomics
Curated by PubChem BioAssay
LigandPNGBDBM80387((3-methyl-1,3-thiazinan-2-ylidene)-p-phenetyl-amin...)
Affinity DataIC50:  1.70E+4nM. Assay description: Data Source: Sanford-Burnham Center for Chemical Genomics (SBCCG) Source Affiliation: Sanford-Burnham Medical Research Institute (SBMRI, San Diego, C...
In DepthDetails PCBioAssay
TargetDNA dC->dU-editing enzyme APOBEC-3G(Homo sapiens (Human))
Burnham Center For Chemical Genomics
Curated by PubChem BioAssay
LigandPNGBDBM80387((3-methyl-1,3-thiazinan-2-ylidene)-p-phenetyl-amin...)
Affinity DataIC50:  2.35E+3nMT: 2°C. Assay description: Data Source: Sanford-Burnham Center for Chemical Genomics (SBCCG) Source Affiliation: Sanford-Burnham Medical Research Institute (SBMRI, San Diego, C...
In DepthDetails PCBioAssay