BDBM81578 AppppA analog, 7 (X=S)
SMILES CC(COP([S-])(=O)OCC1OC(C(O)C1O)n1cnc2c(N)ncnc12)COP([O-])(=S)OCC1OC(C(O)C1O)n1cnc2c(N)ncnc12
InChI Key InChIKey=JMSAQSZAAPNVMD-UHFFFAOYSA-L
Data  1 KI
  Tab Delimited (TSV)   2D SDfile   Computed 3D by Vconf -m prep SDfile
Find this compound or compounds like it in BindingDB:
Activity Spreadsheet -- Enzyme Inhibition Constant Data from BindingDB
Found 1 hit for monomerid = 81578
TargetBis(5'-adenosyl)-triphosphatase(Homo sapiens (Human))
Kimmel Cancer Center
LigandPNGBDBM81578(AppppA analog, 7 (X=S))
Affinity DataKi:  7.60E+4nM. Assay description: Inhibition assay using Fhit with ApppBODIPY.
In DepthDetails ArticlePubMed