BDBM81580 AppppA analog, 9 (X=S)
SMILES Nc1ncnc2n(cnc12)C1OC(COP([O-])(=S)OCCCOP([S-])(=O)OCC2OC(C(O)C2O)n2cnc3c(N)ncnc23)C(O)C1O
InChI Key InChIKey=BSOVZMLTKLKXBZ-UHFFFAOYSA-L
Data  1 KI
  Tab Delimited (TSV)   2D SDfile   Computed 3D by Vconf -m prep SDfile
Find this compound or compounds like it in BindingDB:
Activity Spreadsheet -- Enzyme Inhibition Constant Data from BindingDB
Found 1 hit for monomerid = 81580
TargetBis(5'-adenosyl)-triphosphatase(Homo sapiens (Human))
Kimmel Cancer Center
LigandPNGBDBM81580(AppppA analog, 9 (X=S))
Affinity DataKi:  230nM. Assay description: Inhibition assay using Fhit with ApppBODIPY.
In DepthDetails ArticlePubMed