BDBM81587 AppppA analog, 14 (X=O)
SMILES Nc1ncnc2n(cnc12)C1O[C@H](COP([O-])(=O)OCC(COP([O-])([O-])=O)(COP([O-])([O-])=O)COP([O-])(=O)OCC2O[C@H]([C@H](O)[C@@H]2O)n2cnc3c(N)ncnc23)[C@@H](O)[C@H]1O
InChI Key InChIKey=VHVFNLOTBCCYHK-CAYZEHRUSA-H
Data  1 KI
  Tab Delimited (TSV)   2D SDfile   Computed 3D by Vconf -m prep SDfile
Find this compound or compounds like it in BindingDB:
Activity Spreadsheet -- Enzyme Inhibition Constant Data from BindingDB
Found 1 hit for monomerid = 81587
TargetBis(5'-adenosyl)-triphosphatase(Homo sapiens (Human))
Kimmel Cancer Center
LigandPNGBDBM81587(AppppA analog, 14 (X=O))
Affinity DataKi:  900nM. Assay description: Inhibition assay using Fhit with ApppBODIPY.
In DepthDetails ArticlePubMed