BDBM82428 CAS_124750-95-4::CB91356279::CHEMBL443269::DuP 532
SMILES CCCc1nc(c(C(O)=O)n1Cc1ccc(cc1)-c1ccccc1-c1nnn[nH]1)C(F)(F)C(F)(F)F
InChI Key InChIKey=RQGDXPDTZWGCQI-UHFFFAOYSA-N
Data  1 KI  3 IC50
  Tab Delimited (TSV)   2D SDfile   Computed 3D by Vconf -m prep SDfile
Find this compound or compounds like it in BindingDB:
Activity Spreadsheet -- Enzyme Inhibition Constant Data from BindingDB
Found 4 hits for monomerid = 82428
TargetType-2 angiotensin II receptor(RAT)
Merck Research Laboratories
Curated by PDSP Ki Database
LigandPNGBDBM82428(CAS_124750-95-4 | CB91356279 | CHEMBL443269 | DuP ...)
Affinity DataKi:  5.77E+3nM
In DepthDetails PubMed
TargetType-2 angiotensin II receptor(RAT)
Merck Research Laboratories
Curated by PDSP Ki Database
LigandPNGBDBM82428(CAS_124750-95-4 | CB91356279 | CHEMBL443269 | DuP ...)
Affinity DataIC50: >1.00E+4nM. Assay description: Displacement of [125I]- Ang II from angiotensin II AT2 receptor in rat adrenal cortical microsomes
In DepthDetails Article
LigandPNGBDBM82428(CAS_124750-95-4 | CB91356279 | CHEMBL443269 | DuP ...)
Affinity DataIC50:  3nM. Assay description: Displacement of [125I]- Ang II from angiotensin II AT1 receptor in rat adrenal cortical microsomes
In DepthDetails Article
TargetType-1 angiotensin II receptor(RABBIT)
Merck Research Laboratories
Curated by ChEMBL
LigandPNGBDBM82428(CAS_124750-95-4 | CB91356279 | CHEMBL443269 | DuP ...)
Affinity DataIC50:  1.10nM. Assay description: Evaluation of Angiotensin II antagonistic activity by displacement of [125I]-Sar Ile-AII at the rabbit aorta Angiotensin II receptor, type 1
In DepthDetails ArticlePubMed