BDBM8519 2-[(1S,2S,4S,5R)-2,4-bis(carbamimidamidomethyl)-5-hydroxycyclohexyl]pyridine-3-guanidine::Guanidinylated 2,5-dideoxystreptamine deriv. 8e
SMILES [#7]\[#6](-[#7])=[#7]\[#6]-[#6@@H]-1-[#6]-[#6@H](-[#6]\[#7]=[#6](\[#7])-[#7])-[#6@H](-[#6]-[#6@H]-1-[#8])-c1ncccc1\[#7]=[#6](\[#7])-[#7]
InChI Key InChIKey=FDJUJNOQOFELMR-FYLLDIAZSA-N
Data  1 KI
  Tab Delimited (TSV)   2D SDfile   Computed 3D by Vconf -m prep SDfile
Find this compound or compounds like it in BindingDB:
Activity Spreadsheet -- Enzyme Inhibition Constant Data from BindingDB
Found 1 hit for monomerid = 8519
TargetLethal factor(Bacillus anthracis)
Hawaii Biotech
LigandPNGBDBM8519(2-[(1S,2S,4S,5R)-2,4-bis(carbamimidamidomethyl)-5-...)
Affinity DataKi:  4.10E+3nM ΔG°:  -7.27kcal/molepH: 7.4 T: 2°C. Assay description: The enzymatic reaction started by the addition fluorogenic peptide substrate, MAPKKide to the buffer containing LF and inhibitor compound. Cleavage o...
In DepthDetails ArticlePubMed