BDBM87218 N-[(1S)-2-[4-(5-chloro-2-keto-3H-benzimidazol-1-yl)piperidino]-1-methyl-ethyl]-4-fluoro-benzamide;2,2,2-trifluoroacetic acid::N-[(2S)-1-[4-(5-chloranyl-2-oxidanylidene-3H-benzimidazol-1-yl)piperidin-1-yl]propan-2-yl]-4-fluoranyl-benzamide;2,2,2-tris(fluoranyl)ethanoic acid::N-[(2S)-1-[4-(5-chloro-2-oxo-3H-benzimidazol-1-yl)-1-piperidinyl]propan-2-yl]-4-fluorobenzamide;2,2,2-trifluoroacetic acid::N-[(2S)-1-[4-(5-chloro-2-oxo-3H-benzimidazol-1-yl)piperidin-1-yl]propan-2-yl]-4-fluorobenzamide;2,2,2-trifluoroacetic acid::VU0359559-1::cid_53470197
SMILES C[C@@H](CN1CCC(CC1)n1c2ccc(Cl)cc2[nH]c1=O)NC(=O)c1ccc(F)cc1
InChI Key InChIKey=HWADTVICUCSBRJ-AWEZNQCLSA-N
Data  2 IC50
  Tab Delimited (TSV)   2D SDfile   Computed 3D by Vconf -m prep SDfile
Find this compound or compounds like it in BindingDB:
Activity Spreadsheet -- Enzyme Inhibition Constant Data from BindingDB
Found 2 hits for monomerid = 87218
TargetPhospholipase D1(Homo sapiens (Human))
Vanderbilt Specialized Chemistry Center
Curated by PubChem BioAssay
LigandPNGBDBM87218(N-[(1S)-2-[4-(5-chloro-2-keto-3H-benzimidazol-1-yl...)
Affinity DataIC50:  10nM. Assay description: Phospholipase D (PLD) generates the lipid second messenger phosphatidic acid as part of a plethora of cellular functions. Phosphatidic acid (PtdOH) i...
In DepthDetails PCBioAssay
TargetPhospholipase D2(Homo sapiens (Human))
Vanderbilt Specialized Chemistry Center
Curated by PubChem BioAssay
LigandPNGBDBM87218(N-[(1S)-2-[4-(5-chloro-2-keto-3H-benzimidazol-1-yl...)
Affinity DataIC50:  1.40E+3nM. Assay description: Phospholipase D (PLD) generates the lipid second messenger phosphatidic acid as part of a plethora of cellular functions. Phosphatidic acid (PtdOH) i...
In DepthDetails PCBioAssay