BDBM8911 3-(5-Bromo-6-methoxy-2-naphthyl)pyridine::3-(5-bromo-6-methoxynaphthalen-2-yl)pyridine::Pyridine-substituted naphthalene 10::US9271963, 10
SMILES COc1ccc2cc(ccc2c1Br)-c1cccnc1
InChI Key InChIKey=ZVOWEWSHEFYCIY-UHFFFAOYSA-N
Data  6 IC50
  Tab Delimited (TSV)   2D SDfile   Computed 3D by Vconf -m prep SDfile
Find this compound or compounds like it in BindingDB:
Activity Spreadsheet -- Enzyme Inhibition Constant Data from BindingDB
Found 6 hits for monomerid = 8911
TargetCytochrome P450 11B1, mitochondrial(Homo sapiens (Human))
Saarland University
LigandPNGBDBM8911(3-(5-Bromo-6-methoxy-2-naphthyl)pyridine | 3-(5-br...)
Affinity DataIC50:  4.48E+3nMpH: 7.4 T: 2°C. Assay description: The enzyme activity was assayed by monitoring the conversion of deoxycorticosterone to corticosterone in the presence of inhibitor compounds. The pro...
Ligand InfoPC cidPC sid
In DepthDetails ArticlePubMed
TargetCytochrome P450 11B2, mitochondrial(Homo sapiens (Human))
Saarland University
LigandPNGBDBM8911(3-(5-Bromo-6-methoxy-2-naphthyl)pyridine | 3-(5-br...)
Affinity DataIC50:  33nM. Assay description: The enzyme activity was assayed by monitoring the conversion of deoxycorticosterone to corticosterone in the presence of inhibitor compounds. The pro...
Ligand InfoPC cidPC sid
In DepthDetails ArticlePubMed
TargetAromatase(Homo sapiens (Human))
Universitat Des Saarlandes
US Patent
LigandPNGBDBM8911(3-(5-Bromo-6-methoxy-2-naphthyl)pyridine | 3-(5-br...)
Affinity DataIC50:  9.11E+3nMpH: 7.4Assay Description:The enzyme was obtained from the microsome fraction of fresh human placenta (St. Josephs Krankenhaus, Saarbrucken-Dudweiler, Germany) according to th...
Ligand InfoPC cidPC sid
In DepthDetails US Patent
TargetCytochrome P450 11B1, mitochondrial(Homo sapiens (Human))
Saarland University
LigandPNGBDBM8911(3-(5-Bromo-6-methoxy-2-naphthyl)pyridine | 3-(5-br...)
Affinity DataIC50:  1.53E+3nMT: 2°C. Assay description: V79 MZh11B1 and V79 MZh 11B2 cells (8˙10^5 cells per well) were grown to confluency on 24-well cell culture plates with 1.9 cm^2 culture area per...
Ligand InfoPC cidPC sid
In DepthDetails US Patent
TargetCytochrome P450 11B2, mitochondrial(Homo sapiens (Human))
Saarland University
LigandPNGBDBM8911(3-(5-Bromo-6-methoxy-2-naphthyl)pyridine | 3-(5-br...)
Affinity DataIC50:  33nMT: 2°C. Assay description: V79 MZh11B1 and V79 MZh 11B2 cells (8˙10^5 cells per well) were grown to confluency on 24-well cell culture plates with 1.9 cm^2 culture area per...
Ligand InfoPC cidPC sid
In DepthDetails US Patent
TargetAromatase(Homo sapiens (Human))
Universitat Des Saarlandes
US Patent
LigandPNGBDBM8911(3-(5-Bromo-6-methoxy-2-naphthyl)pyridine | 3-(5-br...)
Affinity DataIC50:  9.11E+3nM. Assay description: The enzyme activity was assayed by measuring the 3H-labeled H2O formed from [1beta-3H] Androstenedione during aromatization. After incubation, the re...
Ligand InfoPC cidPC sid
In DepthDetails ArticlePubMed