BDBM91826 Chk1_100
SMILES COc1cc(ccc1[N+]([O-])=O)-c1ccc2c(Nc3ccc(NC(N)=O)cc3NC2=O)c1
InChI Key InChIKey=PATWWFLETJRYOH-UHFFFAOYSA-N
Data  1 KI  1 IC50
  Tab Delimited (TSV)   2D SDfile   Computed 3D by Vconf -m prep SDfile
Find this compound or compounds like it in BindingDB:
Activity Spreadsheet -- Enzyme Inhibition Constant Data from BindingDB
Found 1 hit for monomerid = 91826
TargetSerine/threonine-protein kinase Chk1(Homo sapiens (Human))
Csar
LigandPNGBDBM91826(Chk1_100)
Affinity DataIC50:  6nM. Assay description: Abbott Kinase Enzymatics_CHK1/289 CDC25c - IC50(uM) (IC50)
In DepthDetails PubMed