BDBM91917 Chk1_50
SMILES CCOC(=O)CCCCCOc1ccc(Cl)cc1NC(=O)Nc1cnc(cn1)C#N
InChI Key InChIKey=UMSJTLJUVVWWKE-UHFFFAOYSA-N
Data  1 KI  1 IC50
  Tab Delimited (TSV)   2D SDfile   Computed 3D by Vconf -m prep SDfile
Find this compound or compounds like it in BindingDB:
Activity Spreadsheet -- Enzyme Inhibition Constant Data from BindingDB
Found 2 hits for monomerid = 91917
TargetSerine/threonine-protein kinase Chk1 [2-280](Homo sapiens (Human))
D3R/Abbott
LigandPNGBDBM91917(Chk1_50)
Affinity DataKi:  380nM. Assay description: 33P-Radiometric_Method1
In DepthDetails PubMed
TargetSerine/threonine-protein kinase Chk1(Homo sapiens (Human))
Csar
LigandPNGBDBM91917(Chk1_50)
Affinity DataIC50:  380nM. Assay description: Abbott Kinase Enzymatics_CHK1/289 CDC25c - IC50(uM) (IC50)
In DepthDetails PubMed