BDBM91944 Chk1_75
SMILES CC(C)(C)c1ccc(NC(=O)Nc2cnc(cn2)C#N)cc1
InChI Key InChIKey=RXMZVJWXAFSOGV-UHFFFAOYSA-N
Data  1 KI  1 IC50
  Tab Delimited (TSV)   2D SDfile   Computed 3D by Vconf -m prep SDfile
Find this compound or compounds like it in BindingDB:
Activity Spreadsheet -- Enzyme Inhibition Constant Data from BindingDB
Found 1 hit for monomerid = 91944
TargetSerine/threonine-protein kinase Chk1(Homo sapiens (Human))
Csar
LigandPNGBDBM91944(Chk1_75)
Affinity DataIC50:  1.00E+4nM. Assay description: Abbott Kinase Enzymatics_CHK1/289 CDC25c - IC50(uM) (IC50)
In DepthDetails PubMed