BDBM92046 erk000461
SMILES Cc1cnc(NCCO)nc1-c1c[nH]c(c1)C(=O)N[C@H](CO)c1ccccc1
InChI Key InChIKey=XOXWKNNWXPMQJN-QGZVFWFLSA-N
Data  2 KI
  Tab Delimited (TSV)   2D SDfile   Computed 3D by Vconf -m prep SDfile
Find this compound or compounds like it in BindingDB:
Activity Spreadsheet -- Enzyme Inhibition Constant Data from BindingDB
Found 1 hit for monomerid = 92046
TargetMitogen-activated protein kinase 1(Homo sapiens (Human))
Csar
LigandPNGBDBM92046(erk000461)
Affinity DataKi:  17nM. Assay description: Assay 1 ...
In DepthDetails PubMed