BDBM92161 erk000612
SMILES Cc1cnc(N[C@H]2CCC[C@H]2O)nc1-c1c[nH]c(c1)C(=O)N[C@H](CO)c1cccc(Cl)c1
InChI Key InChIKey=YHAHBTVACXRYBC-DFQSSKMNSA-N
Data  2 KI
  Tab Delimited (TSV)   2D SDfile   Computed 3D by Vconf -m prep SDfile
Find this compound or compounds like it in BindingDB:
Activity Spreadsheet -- Enzyme Inhibition Constant Data from BindingDB
Found 2 hits for monomerid = 92161
TargetMitogen-activated protein kinase 1(Homo sapiens (Human))
Csar
LigandPNGBDBM92161(erk000612)
Affinity DataKi:  7nM. Assay description: Assay 1 ...
In DepthDetails PubMed
TargetMitogen-activated protein kinase 1(Homo sapiens (Human))
Csar
LigandPNGBDBM92161(erk000612)
Affinity DataKi:  7.10nM. Assay description: Photometric_Method2
In DepthDetails PubMed