BDBM92229 erk000697
SMILES CC[C@@H](CO)Nc1ncc(F)c(n1)-c1c[nH]c(c1)C(=O)N[C@H](CO)c1cccc(Cl)c1
InChI Key InChIKey=KCKYMDMIPKHNKE-MAUKXSAKSA-N
Data  2 KI
  Tab Delimited (TSV)   2D SDfile   Computed 3D by Vconf -m prep SDfile
Find this compound or compounds like it in BindingDB:
Activity Spreadsheet -- Enzyme Inhibition Constant Data from BindingDB
Found 1 hit for monomerid = 92229
TargetMitogen-activated protein kinase 1(Homo sapiens (Human))
D3R/Abbott
LigandPNGBDBM92229(erk000697)
Affinity DataKi:  3nM. Assay description: Photometric_Method2
In DepthDetails PubMed