BDBM92537 GMP
SMILES Nc1nc2n(cnc2c(=O)[nH]1)C1OC(COP([O-])([O-])=O)C(O)C1O
InChI Key InChIKey=RQFCJASXJCIDSX-UHFFFAOYSA-L
Data  1 KI
  Tab Delimited (TSV)   2D SDfile   Computed 3D by Vconf -m prep SDfile
Find this compound or compounds like it in BindingDB:
Activity Spreadsheet -- Enzyme Inhibition Constant Data from BindingDB
Found 1 hit for monomerid = 92537
Target2'-deoxynucleoside 5'-phosphate N-hydrolase 1(Rattus norvegicus (Rat))
Institut Pasteur
LigandPNGBDBM92537(GMP)
Affinity DataKi:  2.00E+4nM. Assay description: Rcl inhibition by nucleotides.
In DepthDetails ArticlePubMed