BDBM92706 Photoaffinity ligand, 3
SMILES Clc1cc2Oc3cc(Cl)c(cc3Oc2cc1Cl)N=[N]#N
InChI Key InChIKey=HFLSWLMOHCDXRK-UHFFFAOYSA-N
Data  1 Kd
  Tab Delimited (TSV)   2D SDfile   Computed 3D by Vconf -m prep SDfile
Find this compound or compounds like it in BindingDB:
Activity Spreadsheet -- Enzyme Inhibition Constant Data from BindingDB
Found 1 hit for monomerid = 92706
TargetAryl hydrocarbon receptor(Mus musculus (Mouse))
University of Wisconsin
LigandPNGBDBM92706(Photoaffinity ligand, 3)
Affinity DataKd:  0.490nMpH: 7.5 T: 2°C. Assay description: The equilibrium dissocation constants, KD values for the photoaffinity ligands were determined by a competitive binding assay.
Ligand InfoPC cidPC sid
In DepthDetails PubMed