BDBM92911 Nucleoside, C6
SMILES Nc1ccn(C2OC(CO)C(O)C(F)C2O)c(=O)n1
InChI Key InChIKey=AGFREDUIXIMAKC-UHFFFAOYSA-N
Data  1 KI
PDB links: 1 PDB ID matches this monomer.
  Tab Delimited (TSV)   2D SDfile   Computed 3D by Vconf -m prep SDfile
Find this compound or compounds like it in BindingDB:
Activity Spreadsheet -- Enzyme Inhibition Constant Data from BindingDB
Found 1 hit for monomerid = 92911
TargetPoly(A)-specific ribonuclease PARN(Homo sapiens (Human))
University of Thessaly
LigandPNGBDBM92911(Nucleoside, C6)
Affinity DataKi:  6.45E+5nM. Assay description: The enzymatic activity was determined by the methylene blue assay.
In DepthDetails ArticlePubMed