BDBM93712 2-(1,3-benzothiazol-2-ylmethylsulfanyl)-1,3-benzoxazole::2-(1,3-benzothiazol-2-ylmethylthio)-1,3-benzoxazole::MLS000057746::SMR000061676::cid_2367151
SMILES C(Sc1nc2ccccc2o1)c1nc2ccccc2s1
InChI Key InChIKey=TWNXLKOZGNCMOC-UHFFFAOYSA-N
Data  2 IC50
  Tab Delimited (TSV)   2D SDfile   Computed 3D by Vconf -m prep SDfile
Find this compound or compounds like it in BindingDB:
Activity Spreadsheet -- Enzyme Inhibition Constant Data from BindingDB
Found 2 hits for monomerid = 93712
TargetHeat shock protein hsp-16.2(Caenorhabditis elegans)
Burnham Center For Chemical Genomics
Curated by PubChem BioAssay
LigandPNGBDBM93712(2-(1,3-benzothiazol-2-ylmethylsulfanyl)-1,3-benzox...)
Affinity DataIC50:  3.85E+4nM
In DepthDetails PCBioAssay
TargetProtein skinhead-1(Caenorhabditis elegans)
Burnham Center For Chemical Genomics
Curated by PubChem BioAssay
LigandPNGBDBM93712(2-(1,3-benzothiazol-2-ylmethylsulfanyl)-1,3-benzox...)
Affinity DataIC50:  2.74E+4nM
In DepthDetails PCBioAssay