BDBM93723 4-bromanyl-1-[(3,4-dichlorophenyl)methyl]pyrazole::4-bromo-1-(3,4-dichlorobenzyl)-1H-pyrazole::4-bromo-1-(3,4-dichlorobenzyl)pyrazole::4-bromo-1-[(3,4-dichlorophenyl)methyl]pyrazole::MLS000052027::SMR000081306::cid_1250725
SMILES Clc1ccc(Cn2cc(Br)cn2)cc1Cl
InChI Key InChIKey=KDQPQDQNMAPJKZ-UHFFFAOYSA-N
Data  2 IC50
  Tab Delimited (TSV)   2D SDfile   Computed 3D by Vconf -m prep SDfile
Find this compound or compounds like it in BindingDB:
Activity Spreadsheet -- Enzyme Inhibition Constant Data from BindingDB
Found 2 hits for monomerid = 93723
TargetHeat shock protein hsp-16.2(Caenorhabditis elegans)
Burnham Center For Chemical Genomics
Curated by PubChem BioAssay
LigandPNGBDBM93723(4-bromanyl-1-[(3,4-dichlorophenyl)methyl]pyrazole ...)
Affinity DataIC50:  3.44E+4nM
In DepthDetails PCBioAssay
TargetProtein skinhead-1(Caenorhabditis elegans)
Burnham Center For Chemical Genomics
Curated by PubChem BioAssay
LigandPNGBDBM93723(4-bromanyl-1-[(3,4-dichlorophenyl)methyl]pyrazole ...)
Affinity DataIC50:  3.06E+4nM
In DepthDetails PCBioAssay