BDBM93836 3-chlorobenzyl 2,5-dimethyl-4-(morpholinomethyl)phenyl ether::4-[4-(3-chlorobenzyl)oxy-2,5-dimethyl-benzyl]morpholine::4-[[4-[(3-chlorophenyl)methoxy]-2,5-dimethyl-phenyl]methyl]morpholine::4-[[4-[(3-chlorophenyl)methoxy]-2,5-dimethylphenyl]methyl]morpholine::MLS000763466::SMR000336823::cid_3517731
SMILES Cc1cc(OCc2cccc(Cl)c2)c(C)cc1CN1CCOCC1
InChI Key InChIKey=CUIUEXNTAMQGBK-UHFFFAOYSA-N
Data  2 IC50
  Tab Delimited (TSV)   2D SDfile   Computed 3D by Vconf -m prep SDfile
Find this compound or compounds like it in BindingDB:
Activity Spreadsheet -- Enzyme Inhibition Constant Data from BindingDB
Found 2 hits for monomerid = 93836
TargetHeat shock protein hsp-16.2(Caenorhabditis elegans)
Burnham Center For Chemical Genomics
Curated by PubChem BioAssay
LigandPNGBDBM93836(3-chlorobenzyl 2,5-dimethyl-4-(morpholinomethyl)ph...)
Affinity DataIC50:  5.06E+4nM
In DepthDetails PCBioAssay
TargetProtein skinhead-1(Caenorhabditis elegans)
Burnham Center For Chemical Genomics
Curated by PubChem BioAssay
LigandPNGBDBM93836(3-chlorobenzyl 2,5-dimethyl-4-(morpholinomethyl)ph...)
Affinity DataIC50:  1.52E+4nM
In DepthDetails PCBioAssay