BDBM93933 (5,7-dichloro-2-naphthyl)amine::5,7-bis(chloranyl)naphthalen-2-amine::5,7-dichloro-2-naphthalenamine::5,7-dichloronaphthalen-2-amine::MLS003106370::SMR001821276::cid_289769
SMILES Nc1ccc2c(Cl)cc(Cl)cc2c1
InChI Key InChIKey=DSLZCMZADMRBGM-UHFFFAOYSA-N
Data  2 IC50
  Tab Delimited (TSV)   2D SDfile   Computed 3D by Vconf -m prep SDfile
Find this compound or compounds like it in BindingDB:
Activity Spreadsheet -- Enzyme Inhibition Constant Data from BindingDB
Found 2 hits for monomerid = 93933
TargetHeat shock protein hsp-16.2(Caenorhabditis elegans)
Burnham Center For Chemical Genomics
Curated by PubChem BioAssay
LigandPNGBDBM93933((5,7-dichloro-2-naphthyl)amine | 5,7-bis(chloranyl...)
Affinity DataIC50:  4.33E+4nM
Ligand InfoPC cidPC sid
In DepthDetails PCBioAssay
TargetProtein skinhead-1(Caenorhabditis elegans)
Burnham Center For Chemical Genomics
Curated by PubChem BioAssay
LigandPNGBDBM93933((5,7-dichloro-2-naphthyl)amine | 5,7-bis(chloranyl...)
Affinity DataIC50:  2.85E+4nM
Ligand InfoPC cidPC sid
In DepthDetails PCBioAssay